Reaction Details
TargetPancreatic alpha-amylase
LigandBDBM50401979
Substrate/Competitorn/a
Meas. Tech.ChEMBL_886576 (CHEMBL2215736)
IC50 22960±n/a nM
Citation Patil, VSNandre, KPGhosh, SRao, VJChopade, BABhosale, SVBhosale, SV Synthesis and glycosidase inhibitory activity of novel (2-phenyl-4H-benzopyrimedo[2,1-b]-thiazol-4-yliden)acetonitrile derivatives. Bioorg Med Chem Lett22:7011-4 (2012) 
 
Pancreatic alpha-amylase
Name:Pancreatic alpha-amylase
Type:Protein
Mol. Mass.:57088.07
Organism:Sus scrofa (Pig)
Description:P00690
Residue:511
BDBM50401979
NameBDBM50401979
Synonyms:CHEMBL2207948
TypeSmall organic molecule
Emp. Form.C18H11N3S
Mol. Mass.301.365
SMILESN#C\C=C1/C=C(N=C2Sc3ccccc3N12)c1ccccc1