Reaction Details
TargetLysosomal alpha-glucosidase
LigandBDBM50401979
Substrate/Competitorn/a
Meas. Tech.ChEMBL_886575 (CHEMBL2215735)
IC50 23540±n/a nM
Citation Patil, VSNandre, KPGhosh, SRao, VJChopade, BABhosale, SVBhosale, SV Synthesis and glycosidase inhibitory activity of novel (2-phenyl-4H-benzopyrimedo[2,1-b]-thiazol-4-yliden)acetonitrile derivatives. Bioorg Med Chem Lett22:7011-4 (2012) 
 
Lysosomal alpha-glucosidase
Name:Lysosomal alpha-glucosidase
Type:Enzyme
Mol. Mass.:106235.32
Organism:Mus musculus (Mouse)
Description:P70699
Residue:953
BDBM50401979
NameBDBM50401979
Synonyms:CHEMBL2207948
TypeSmall organic molecule
Emp. Form.C18H11N3S
Mol. Mass.301.365
SMILESN#C\C=C1/C=C(N=C2Sc3ccccc3N12)c1ccccc1