Reaction Details
TargetPeroxisome proliferator-activated receptor alpha
LigandBDBM28699
Substrate/Competitorn/a
Meas. Tech.ChEMBL_886596 (CHEMBL2215756)
EC50 55000±n/a nM
Citation Giampietro, LD'Angelo, AGiancristofaro, AAmmazzalorso, ADe Filippis, BFantacuzzi, MLinciano, PMaccallini, CAmoroso, R Synthesis and structure-activity relationships of fibrate-based analogues inside PPARs. Bioorg Med Chem Lett22:7662-6 (2012) 
 
Peroxisome proliferator-activated receptor alpha
Name:Peroxisome proliferator-activated receptor alpha
Type:Enzyme
Mol. Mass.:52222.08
Organism:Homo sapiens (Human)
Description:Q07869
Residue:468
BDBM28699
NameBDBM28699
Synonyms:2-(4-chlorophenoxy)-2-methylpropanoic acid Clofibrate clofibric acid
TypeSmall organic molecule
Emp. Form.C10H11ClO3
Mol. Mass.214.646
SMILESCC(C)(Oc1ccc(Cl)cc1)C(O)=O