Reaction Details
TargetIndoleamine 2,3-dioxygenase 2
LigandBDBM31770
Substrate/Competitorn/a
Meas. Tech.ChEMBL_885588 (CHEMBL2210857)
IC50 10100±n/a nM
Citation Bakmiwewa, SMFatokun, AATran, APayne, RJHunt, NHBall, HJ Identification of selective inhibitors of indoleamine 2,3-dioxygenase 2. Bioorg Med Chem Lett22:7641-6 (2012) 
 
Indoleamine 2,3-dioxygenase 2
Name:Indoleamine 2,3-dioxygenase 2
Type:PROTEIN
Mol. Mass.:45256.34
Organism:Mus musculus
Description:ChEMBL_105489
Residue:405
BDBM31770
NameBDBM31770
Synonyms:Exelderm cid_65495 | sulconazole
TypeSmall organic molecule
Emp. Form.C18H15Cl3N2S
Mol. Mass.397.749
SMILESClc1ccc(CSC(Cn2ccnc2)c2ccc(Cl)cc2Cl)cc1