Reaction Details
TargetIndoleamine 2,3-dioxygenase 2
LigandBDBM14390
Substrate/Competitorn/a
Meas. Tech.ChEMBL_885588 (CHEMBL2210857)
IC50 4500±n/a nM
Citation Bakmiwewa, SMFatokun, AATran, APayne, RJHunt, NHBall, HJ Identification of selective inhibitors of indoleamine 2,3-dioxygenase 2. Bioorg Med Chem Lett22:7641-6 (2012) 
 
Indoleamine 2,3-dioxygenase 2
Name:Indoleamine 2,3-dioxygenase 2
Type:PROTEIN
Mol. Mass.:45256.34
Organism:Mus musculus
Description:ChEMBL_105489
Residue:405
BDBM14390
NameBDBM14390
Synonyms:5-[2-ethoxy-5-(4-methyl-1-piperazinylsulfonyl)phenyl]-1-methyl-3-n-propyl-1,6-dihydro-7H-pyrazolo[4,3-d]pyrimidin-7-one CHEMBL192 Sildenafil US11155558, Compound sildenafil US11897890, Compound sildenafil | Viagra
TypeSmall organic molecule
Emp. Form.C22H30N6O4S
Mol. Mass.474.576
SMILESCCCc1nn(C)c2c1nc([nH]c2=O)-c1cc(ccc1OCC)S(=O)(=O)N1CCN(C)CC1