Reaction Details
TargetFibroblast growth factor receptor 3
LigandBDBM50402339
Substrate/Competitorn/a
Meas. Tech.ChEMBL_885946 (CHEMBL2215708)
IC50 4200±n/a nM
Citation Miyamoto, NOguro, YTakagi, TIwata, HMiki, HHori, AImamura, S Design, synthesis, and evaluation of imidazo[1,2-b]pyridazine derivatives having a benzamide unit as novel VEGFR2 kinase inhibitors. Bioorg Med Chem20:7051-8 (2012) 
 
Fibroblast growth factor receptor 3
Name:Fibroblast growth factor receptor 3
Type:Protein
Mol. Mass.:87699.57
Organism:Homo sapiens (Human)
Description:P22607
Residue:806
BDBM50402339
NameBDBM50402339
Synonyms:CHEMBL2206666
TypeSmall organic molecule
Emp. Form.C20H13F3N4O2
Mol. Mass.398.338
SMILESFC(F)(F)c1cccc(c1)C(=O)Nc1cccc(Oc2ccc3nccn3n2)c1