Reaction Details
TargetVascular endothelial growth factor receptor 2
LigandBDBM50402341
Substrate/Competitorn/a
Meas. Tech.ChEMBL_885952 (CHEMBL2215714)
IC50 640±n/a nM
Citation Miyamoto, NOguro, YTakagi, TIwata, HMiki, HHori, AImamura, S Design, synthesis, and evaluation of imidazo[1,2-b]pyridazine derivatives having a benzamide unit as novel VEGFR2 kinase inhibitors. Bioorg Med Chem20:7051-8 (2012) 
 
Vascular endothelial growth factor receptor 2
Name:Vascular endothelial growth factor receptor 2
Type:Receptor Tyrosine Kinase
Mol. Mass.:151510.97
Organism:Homo sapiens (Human)
Description:P35968
Residue:1356
BDBM50402341
NameBDBM50402341
Synonyms:CHEMBL2206667
TypeSmall organic molecule
Emp. Form.C19H14N4O2
Mol. Mass.330.3401
SMILESO=C(Nc1ccccc1)c1cccc(Oc2ccc3nccn3n2)c1