Reaction Details
TargetUrokinase plasminogen activator surface receptor
LigandBDBM50402367
Substrate/Competitorn/a
Meas. Tech.ChEMBL_886136 (CHEMBL2210436)
Ki 0.007±n/a nM
Citation Omar, MAShaker, YMGalal, SAAli, MMKerwin, SMLi, JTokuda, HRamadan, RAEl Diwani, HI Synthesis and docking studies of novel antitumor benzimidazoles. Bioorg Med Chem20:6989-7001 (2012) 
 
Urokinase plasminogen activator surface receptor
Name:Urokinase plasminogen activator surface receptor
Type:Receptor
Mol. Mass.:36979.14
Organism:Homo sapiens (Human)
Description:Q03405
Residue:335
BDBM50402367
NameBDBM50402367
Synonyms:CHEMBL2206695
TypeSmall organic molecule
Emp. Form.C22H17N5
Mol. Mass.351.4039
SMILESNc1c(cc(-c2ccccc2)n1-c1ccccn1)-c1nc2ccccc2[nH]1