Reaction Details
TargetUrokinase plasminogen activator surface receptor
LigandBDBM50402379
Substrate/Competitorn/a
Meas. Tech.ChEMBL_886136 (CHEMBL2210436)
Ki 0.296±n/a nM
Citation Omar, MAShaker, YMGalal, SAAli, MMKerwin, SMLi, JTokuda, HRamadan, RAEl Diwani, HI Synthesis and docking studies of novel antitumor benzimidazoles. Bioorg Med Chem20:6989-7001 (2012) 
 
Urokinase plasminogen activator surface receptor
Name:Urokinase plasminogen activator surface receptor
Type:Receptor
Mol. Mass.:36979.14
Organism:Homo sapiens (Human)
Description:Q03405
Residue:335
BDBM50402379
NameBDBM50402379
Synonyms:CHEMBL2206686
TypeSmall organic molecule
Emp. Form.C11H8N2O
Mol. Mass.184.194
SMILESO=C(CC(C#N)C#N)c1ccccc1