Reaction Details
TargetGlucocorticoid receptor
LigandBDBM50402499
Substrate/Competitorn/a
Meas. Tech.ChEMBL_886649 (CHEMBL2216234)
Ki 7±n/a nM
Citation Hunt, HJRay, NCHynd, GSutton, JSajad, MO'Connor, EAhmed, SLockey, PDaly, SBuckley, GClark, RDRoe, RBlasey, CBelanoff, J Discovery of a novel non-steroidal GR antagonist with in vivo efficacy in the olanzapine-induced weight gain model in the rat. Bioorg Med Chem Lett22:7376-80 (2012) 
 
Glucocorticoid receptor
Name:Glucocorticoid receptor
Type:Enzyme
Mol. Mass.:85656.87
Organism:Homo sapiens (Human)
Description:P04150
Residue:777
BDBM50402499
NameBDBM50402499
Synonyms:CHEMBL2204042
TypeSmall organic molecule
Emp. Form.C23H23ClN2O2
Mol. Mass.394.894
SMILESClc1ccccc1Cc1c([nH]c(=O)[nH]c1=O)[C@@H]1CC[C@@H](CC1)c1ccccc1