Reaction Details
TargetBone morphogenetic protein 1
LigandBDBM13095
Substrate/Competitorn/a
Meas. Tech.ChEMBL_886679 (CHEMBL2216696)
IC50 18000±n/a nM
Citation Turtle, EChow, NYang, CSosa, SBauer, UBrenner, MSolow-Cordero, DHo, WB Design and synthesis of procollagen C-proteinase inhibitors. Bioorg Med Chem Lett22:7397-401 (2012) 
 
Bone morphogenetic protein 1
Name:Bone morphogenetic protein 1
Type:PROTEIN
Mol. Mass.:111254.03
Organism:Homo sapiens (Human)
Description:ChEMBL_518962
Residue:986
BDBM13095
NameBDBM13095
Synonyms:CGS 27023A Analog 23 | N-hydroxy-2-[(4-methoxybenzene)(2-phenylethyl)sulfonamido]acetamide
TypeSmall organic molecule
Emp. Form.C17H20N2O5S
Mol. Mass.364.416
SMILESCOc1ccc(cc1)S(=O)(=O)N(CCc1ccccc1)CC(=O)NO