Reaction Details
Target3-oxo-5-alpha-steroid 4-dehydrogenase 1
LigandBDBM50044878
Substrate/Competitorn/a
Meas. Tech.ChEBML_204899
IC50 32±n/a nM
Citation Wikel, JHBemis, KGAudia, JEMcQuaid, LAJones, CDPennington, PALawhorn, DEHirsch, KRStamm, NB QSAR study of benzoquinolinones as inhibitors of human type 1 5--reductase. Bioorg Med Chem Lett3:1157-1162 (1993)    Article
 
3-oxo-5-alpha-steroid 4-dehydrogenase 1
Name:3-oxo-5-alpha-steroid 4-dehydrogenase 1
Type:Enzyme
Mol. Mass.:29472.80
Organism:Homo sapiens (Human)
Description:P18405
Residue:259
BDBM50044878
NameBDBM50044878
Synonyms:4,8-Dimethyl-1,4,4a,5,6,10b-hexahydro-2H-benzo[f]quinolin-3-one | CHEMBL134357
TypeSmall organic molecule
Emp. Form.C15H19NO
Mol. Mass.229.3175
SMILESCN1[C@@H]2CCc3cc(C)ccc3[C@H]2CCC1=O