Reaction Details
TargetType-1 angiotensin II receptor
LigandBDBM50280319
Substrate/Competitorn/a
Meas. Tech.ChEMBL_36318 (CHEMBL652267)
Kd 31.62±n/a nM
Citation Murray, WLalan, PGill, ALee, DFalotico, RLewis, JAddo, MWachter, M Substituted lactam biphenyltetrazoles as angiotensin II mediated antihypertensives Bioorg Med Chem Lett4:87-92 (1994)    Article
 
Type-1 angiotensin II receptor
Name:Type-1 angiotensin II receptor
Type:Enzyme Catalytic Domain
Mol. Mass.:41009.15
Organism:RABBIT
Description:ANGIOTENSIN AT1 AGTR1 RABBIT::P34976
Residue:359
BDBM50280319
NameBDBM50280319
Synonyms:CHEMBL299151 | [4-Butyl-4-methyl-6-oxo-1-[2'-(1H-tetrazol-5-yl)-biphenyl-4-ylmethyl]-piperidin-(2E)-ylidene]-acetic acid ethyl ester
TypeSmall organic molecule
Emp. Form.C28H33N5O3
Mol. Mass.487.5933
SMILESCCCCC1(C)CC(=O)N(Cc2ccc(cc2)-c2ccccc2-c2nnn[nH]2)\C(C1)=C\C(=O)OCC