Reaction Details
TargetNeprilysin
LigandBDBM50403255
Substrate/Competitorn/a
Meas. Tech.ChEMBL_144627 (CHEMBL883549)
IC50 5.2±n/a nM
Citation Robl, JASimpkins, LMStevenson, JSun, CMurugesan, NBarrish, JCAsaad, MMBird, JSchaeffer, TRTrippodo, NCPetrillo, EWKaranewsky, DS Dual metalloprotease inhibitors. I. constrained peptidomimetics of mercaptoacyl dipeptides Bioorg Med Chem Lett4:1789-1794 (1994)    Article
 
Neprilysin
Name:Neprilysin
Type:Enzyme
Mol. Mass.:85505.38
Organism:Homo sapiens (Human)
Description:P08473
Residue:750
BDBM50403255
NameBDBM50403255
Synonyms:CHEMBL50559
TypeSmall organic molecule
Emp. Form.C21H22N2O5S
Mol. Mass.414.475
SMILESC[C@@H]1Oc2ccccc2N(CC(O)=O)C(=O)[C@H]1NC(=O)[C@@H](S)Cc1ccccc1