Reaction Details
TargetAngiotensin-converting enzyme
LigandBDBM50282861
Substrate/Competitorn/a
Meas. Tech.ChEMBL_35584 (CHEMBL648282)
IC50 4±n/a nM
Citation Robl, JASimpkins, LMStevenson, JSun, CMurugesan, NBarrish, JCAsaad, MMBird, JSchaeffer, TRTrippodo, NCPetrillo, EWKaranewsky, DS Dual metalloprotease inhibitors. I. constrained peptidomimetics of mercaptoacyl dipeptides Bioorg Med Chem Lett4:1789-1794 (1994)    Article
 
Angiotensin-converting enzyme
Name:Angiotensin-converting enzyme
Type:Enzyme
Mol. Mass.:149709.01
Organism:Homo sapiens (Human)
Description:n/a
Residue:1306
BDBM50282861
NameBDBM50282861
Synonyms:(S)-1-[(S)-2-((S)-2-Mercaptomethyl-3-phenyl-propionylamino)-propionyl]-pyrrolidine-2-carboxylic acid | CHEMBL299181
TypeSmall organic molecule
Emp. Form.C18H24N2O4S
Mol. Mass.364.459
SMILESC[C@H](NC(=O)[C@@H](CS)Cc1ccccc1)C(=O)N1CCC[C@H]1C(O)=O