Reaction Details
TargetNeprilysin
LigandBDBM50403257
Substrate/Competitorn/a
Meas. Tech.ChEMBL_144627 (CHEMBL883549)
IC50 1.7±n/a nM
Citation Robl, JASimpkins, LMStevenson, JSun, CMurugesan, NBarrish, JCAsaad, MMBird, JSchaeffer, TRTrippodo, NCPetrillo, EWKaranewsky, DS Dual metalloprotease inhibitors. I. constrained peptidomimetics of mercaptoacyl dipeptides Bioorg Med Chem Lett4:1789-1794 (1994)    Article
 
Neprilysin
Name:Neprilysin
Type:Enzyme
Mol. Mass.:85505.38
Organism:Homo sapiens (Human)
Description:P08473
Residue:750
BDBM50403257
NameBDBM50403257
Synonyms:CHEMBL51438
TypeSmall organic molecule
Emp. Form.C23H26N2O4S
Mol. Mass.426.529
SMILESOC(=O)CCN1c2ccccc2CC[C@H](NC(=O)[C@@H](CS)Cc2ccccc2)C1=O