Reaction Details
TargetNeprilysin
LigandBDBM50403251
Substrate/Competitorn/a
Meas. Tech.ChEMBL_144627 (CHEMBL883549)
IC50 2.2±n/a nM
Citation Robl, JASimpkins, LMStevenson, JSun, CMurugesan, NBarrish, JCAsaad, MMBird, JSchaeffer, TRTrippodo, NCPetrillo, EWKaranewsky, DS Dual metalloprotease inhibitors. I. constrained peptidomimetics of mercaptoacyl dipeptides Bioorg Med Chem Lett4:1789-1794 (1994)    Article
 
Neprilysin
Name:Neprilysin
Type:Enzyme
Mol. Mass.:85505.38
Organism:Homo sapiens (Human)
Description:P08473
Residue:750
BDBM50403251
NameBDBM50403251
Synonyms:CHEMBL299441
TypeSmall organic molecule
Emp. Form.C21H22N2O4S2
Mol. Mass.430.54
SMILESOC(=O)CCN1c2ccccc2SC[C@H](NC(=O)[C@@H](S)Cc2ccccc2)C1=O