Reaction Details
Target3-oxo-5-alpha-steroid 4-dehydrogenase 1
LigandBDBM50403324
Substrate/Competitorn/a
Meas. Tech.ChEBML_204885
Ki 4900±n/a nM
Citation Abell, ADBrandt, MLevy, MAHolt, DA A non-steroidal diene acid inhibitor of human type 2 stereoid 5-reductase Bioorg Med Chem Lett4:2327-2330 (1994)    Article
 
3-oxo-5-alpha-steroid 4-dehydrogenase 1
Name:3-oxo-5-alpha-steroid 4-dehydrogenase 1
Type:Enzyme
Mol. Mass.:29472.80
Organism:Homo sapiens (Human)
Description:P18405
Residue:259
BDBM50403324
NameBDBM50403324
Synonyms:CHEMBL78060
TypeSmall organic molecule
Emp. Form.C26H42NO3P
Mol. Mass.447.5903
SMILESCC(C)N(C(C)C)C(=O)[C@H]1CCC2C3CC=C4C=C(CC[C@]4(C)C3CC[C@]12C)P(O)O