Reaction Details
TargetMuscarinic acetylcholine receptor M4
LigandBDBM39341
Substrate/Competitorn/a
Meas. Tech.ChEMBL_139265 (CHEMBL745073)
Ki 35±n/a nM
Citation Tumiatti, VSanti, SRecanatini, MMinarini, AMelchiorre, CChiarini, ABudriesi, R Design, synthesis and biological activity of some 4-DAMP- related compounds Bioorg Med Chem Lett5:2325-2330 (1995)    Article
 
Muscarinic acetylcholine receptor M4
Name:Muscarinic acetylcholine receptor M4
Type:Enzyme Catalytic Domain
Mol. Mass.:53079.31
Organism:Homo sapiens (Human)
Description:Cholinergic, muscarinic M4 CHRM4 HUMAN M3::P08173
Residue:479
BDBM39341
NameBDBM39341
Synonyms:11-[(4-methylpiperazin-1-yl)acetyl]-5,11-dihydro-6H-pyrido[2,3-b][1,4]benzodiazepin-6-one 11-[2-(4-methylpiperazin-1-yl)acetyl]-5H-pyrido[2,3-b][1,4]benzodiazepin-6-one;hydrochloride 11-[2-(4-methylpiperazino)acetyl]-5H-pyrido[2,3-b][1,4]benzodiazepin-6-one;hydrochloride MLS000069702 PIRENZEPINE DIHYDROCHLORIDE cid_185248
TypeSmall organic molecule
Emp. Form.C19H21N5O2
Mol. Mass.351.4023
SMILESCN1CCN(CC(=O)N2c3ccccc3C(=O)Nc3cccnc23)CC1