Reaction Details
TargetMuscarinic acetylcholine receptor M3
LigandBDBM50176065
Substrate/Competitorn/a
Meas. Tech.ChEMBL_138252 (CHEMBL857566)
Ki 1.1±n/a nM
Citation Tumiatti, VSanti, SRecanatini, MMinarini, AMelchiorre, CChiarini, ABudriesi, R Design, synthesis and biological activity of some 4-DAMP- related compounds Bioorg Med Chem Lett5:2325-2330 (1995)    Article
 
Muscarinic acetylcholine receptor M3
Name:Muscarinic acetylcholine receptor M3
Type:Enzyme Catalytic Domain
Mol. Mass.:66086.66
Organism:RAT
Description:Cholinergic, muscarinic M3 CHRM3 RAT::P08483
Residue:589
BDBM50176065
NameBDBM50176065
Synonyms:4-DAMP Acetic acid 4-[(4-acetoxy-phenyl)-pyridin-2-yl-methyl]-phenyl ester CHEMBL76897
TypeSmall organic molecule
Emp. Form.C21H26NO2
Mol. Mass.324.4361
SMILESC[N+]1(C)CCC(CC1)OC(=O)C(c1ccccc1)c1ccccc1