Reaction Details
TargetPeptidyl-prolyl cis-trans isomerase FKBP1A
LigandBDBM50403486
Substrate/Competitorn/a
Meas. Tech.ChEBML_66277
Ki 258±n/a nM
Citation Tatlock, JHKalish, VJParge, HKnighton, DRShowalter, RELewis, CTFrench, JVillafranca, J High-affinity FKBP-12 ligands derived from (R)-()-carvone. Synthesis and evaluation of FK506 pyranose ring replacements Bioorg Med Chem Lett5:2489-2494 (1995)    Article
 
Peptidyl-prolyl cis-trans isomerase FKBP1A
Name:Peptidyl-prolyl cis-trans isomerase FKBP1A
Type:Isomerase
Mol. Mass.:11953.09
Organism:Homo sapiens (Human)
Description:P62942
Residue:108
BDBM50403486
NameBDBM50403486
Synonyms:CHEMBL82427
TypeSmall organic molecule
Emp. Form.C24H33NO6
Mol. Mass.431.5219
SMILESCOC[C@@H]1CC[C@@H](C)[C@@](O)(C1)C(=O)C(=O)N1CCCC[C@H]1C(=O)OCc1ccccc1