Reaction Details
Target5-hydroxytryptamine receptor 1A
LigandBDBM85079
Substrate/Competitorn/a
Meas. Tech.ChEMBL_1518 (CHEMBL616152)
Ki 0.707946±n/a nM
Citation van Steen, BJvan Wijngaarden, IRonken, ESoudijn, W Functional characteristics of a series of N4-substituted 1-(2,3-dihydro-1,4-benzodioxin-5-yl)piperazines as 5-HT1A receptor ligands. Structure-activity relationships. Bioorg Med Chem Lett8:2457-62 (1999) 5-hydroxytryptamine receptor 1A
Name:5-hydroxytryptamine receptor 1A
Type:G Protein-Coupled Receptor (GPCR)
Mol. Mass.:46445.29
Organism:Rattus norvegicus (rat)
Description:Binding assays were performed using rat hippocampal membranes.
Residue:422
BDBM85079
NameBDBM85079
Synonyms:2-[4-[4-[(7-Chloro-2,3-dihydro-1,4-benzodioxin)-5-yl]-1-piperazinyl]butyl]-1,2-benzisothiazol-3(2H)-one 1,1-dioxide DU-125530 | DU125530
TypeSmall organic molecule
Emp. Form.C23H26ClN3O5S
Mol. Mass.491.988
SMILESClc1cc2OCCOc2c(c1)N1CCN(CCCCN2C(=O)c3ccccc3S2(=O)=O)CC1