Reaction Details
TargetProtein c-Fos/Transcription factor Jun
LigandBDBM50090425
Substrate/Competitorn/a
Meas. Tech.ChEMBL_92286 (CHEMBL705832)
IC50 4000±n/a nM
Citation Palanki, MSErdman, PEManning, AMOw, ARansone, LJSpooner, CSuto, CSuto, M Novel inhibitors of AP-1 and NF-kappaB mediated gene expression: structure-activity relationship studies of ethyl 4-[(3-methyl-2,5-dioxo(3-pyrrolinyl))amino]-2-(trifluoromethyl)++ +pyrimidi ne-5-carboxylate. Bioorg Med Chem Lett10:1645-8 (2000) Protein c-Fos/Transcription factor Jun
Name:Protein c-Fos/Transcription factor Jun
Type:n/a
Mol. Mass.:n/a
Description:ASSAY_ID of EBI is 305353
Components:This complex has 2 components.
Component 1
Name:Transcription factor Jun
Synonyms:AP1 JUN Proto-oncogene c-JUN Transcription factor AP1 p39
Type:n/a
Mol. Mass.:35683.24
Organism:Homo sapiens (Human)
Description:P05412
Residue:331
Component 2
Name:Protein c-Fos
Synonyms:FOS G0S7 | Transcription factor AP1
Type:PROTEIN
Mol. Mass.:40679.34
Organism:Homo sapiens (Human)
Description:EBI_100167
Residue:380
BDBM50090425
NameBDBM50090425
Synonyms:4-[Acetyl-(3-methyl-2,5-dioxo-2,5-dihydro-pyrrol-1-yl)-amino]-2-phenyl-pyrimidine-5-carboxylic acid ethyl ester ethyl 4-(N-(3-methyl-2,5-dioxo-2H-pyrrol-1(5H)-yl)acetamido)-2-phenylpyrimidine-5-carboxylate
TypeSmall organic molecule
Emp. Form.C20H18N4O5
Mol. Mass.394.3807
SMILESCCOC(=O)c1cnc(nc1N(N1C(=O)C=C(C)C1=O)C(C)=O)-c1ccccc1