Reaction Details
TargetProtein c-Fos/Transcription factor Jun
LigandBDBM50090432
Substrate/Competitorn/a
Meas. Tech.ChEMBL_92286 (CHEMBL705832)
IC50 1000±n/a nM
Citation Palanki, MSErdman, PEManning, AMOw, ARansone, LJSpooner, CSuto, CSuto, M Novel inhibitors of AP-1 and NF-kappaB mediated gene expression: structure-activity relationship studies of ethyl 4-[(3-methyl-2,5-dioxo(3-pyrrolinyl))amino]-2-(trifluoromethyl)++ +pyrimidi ne-5-carboxylate. Bioorg Med Chem Lett10:1645-8 (2000) Protein c-Fos/Transcription factor Jun
Name:Protein c-Fos/Transcription factor Jun
Type:n/a
Mol. Mass.:n/a
Description:ASSAY_ID of EBI is 305353
Components:This complex has 2 components.
Component 1
Name:Transcription factor Jun
Synonyms:AP1 JUN Proto-oncogene c-JUN Transcription factor AP1 p39
Type:n/a
Mol. Mass.:35683.24
Organism:Homo sapiens (Human)
Description:P05412
Residue:331
Component 2
Name:Protein c-Fos
Synonyms:FOS G0S7 | Transcription factor AP1
Type:PROTEIN
Mol. Mass.:40679.34
Organism:Homo sapiens (Human)
Description:EBI_100167
Residue:380
BDBM50090432
NameBDBM50090432
Synonyms:2-Cyclopropyl-4-(3-methyl-2,5-dioxo-2,5-dihydro-pyrrol-1-ylamino)-pyrimidine-5-carboxylic acid ethyl ester ethyl 2-cyclopropyl-4-(3-methyl-2,5-dioxo-2H-pyrrol-1(5H)-ylamino)pyrimidine-5-carboxylate
TypeSmall organic molecule
Emp. Form.C15H16N4O4
Mol. Mass.316.3119
SMILESCCOC(=O)c1cnc(nc1NN1C(=O)C=C(C)C1=O)C1CC1