Reaction Details
Target5-hydroxytryptamine receptor 6
LigandBDBM50403838
Substrate/Competitorn/a
Meas. Tech.ChEBML_3647
Ki 1.3±n/a nM
Citation Bromidge, SMClarke, SEGager, TGriffith, KJeffrey, PJennings, AJJoiner, GFKing, FDLovell, PJMoss, SFNewman, HRiley, GRogers, DRoutledge, CSerafinowska, HSmith, DR Phenyl benzenesulfonamides are novel and selective 5-HT6 antagonists: identification of N-(2,5-dibromo-3-fluorophenyl)-4-methoxy-3-piperazin-1-ylbenzenesulfonamide (SB-357134). Bioorg Med Chem Lett11:55-8 (2001) 5-hydroxytryptamine receptor 6
Name:5-hydroxytryptamine receptor 6
Type:G Protein-Coupled Receptor (GPCR)
Mol. Mass.:46968.43
Organism:Homo sapiens (Human)
Description:P50406
Residue:440
BDBM50403838
NameBDBM50403838
Synonyms:CHEMBL154273
TypeSmall organic molecule
Emp. Form.C18H22ClN3O4S
Mol. Mass.411.903
SMILESCOc1ccc(Cl)cc1NS(=O)(=O)c1ccc(OC)c(c1)N1CCNCC1