Reaction Details
Target5-hydroxytryptamine receptor 6
LigandBDBM50403827
Substrate/Competitorn/a
Meas. Tech.ChEBML_3647
Ki 0.316228±n/a nM
Citation Bromidge, SMClarke, SEGager, TGriffith, KJeffrey, PJennings, AJJoiner, GFKing, FDLovell, PJMoss, SFNewman, HRiley, GRogers, DRoutledge, CSerafinowska, HSmith, DR Phenyl benzenesulfonamides are novel and selective 5-HT6 antagonists: identification of N-(2,5-dibromo-3-fluorophenyl)-4-methoxy-3-piperazin-1-ylbenzenesulfonamide (SB-357134). Bioorg Med Chem Lett11:55-8 (2001) 5-hydroxytryptamine receptor 6
Name:5-hydroxytryptamine receptor 6
Type:G Protein-Coupled Receptor (GPCR)
Mol. Mass.:46968.43
Organism:Homo sapiens (Human)
Description:P50406
Residue:440
BDBM50403827
NameBDBM50403827
Synonyms:CHEMBL414628
TypeSmall organic molecule
Emp. Form.C19H22IN3O3S
Mol. Mass.499.366
SMILESCOc1ccc(cc1N1CCNCC1)S(=O)(=O)N1CCc2ccc(I)cc12