Reaction Details
TargetMuscarinic acetylcholine receptor M2
LigandBDBM50404004
Substrate/Competitorn/a
Meas. Tech.ChEMBL_138349 (CHEMBL747778)
Ki 794±n/a nM
Citation Takadoi, MYamaguchi, KTerashima, S Synthesis and muscarinic M(2) subtype antagonistic activity of enantiomeric pairs of 3-demethylhimbacine (3-norhimbacine) and its C(4)-epimer. Bioorg Med Chem Lett12:3271-3 (2002) Muscarinic acetylcholine receptor M2
Name:Muscarinic acetylcholine receptor M2
Type:Enzyme Catalytic Domain
Mol. Mass.:51555.53
Organism:RAT
Description:P10980
Residue:466
BDBM50404004
NameBDBM50404004
Synonyms:CHEMBL111224
TypeSmall organic molecule
Emp. Form.C21H33NO2
Mol. Mass.331.4922
SMILESC[C@H]1CCC[C@H](\C=C\[C@H]2[C@H]3COC(=O)[C@H]3C[C@H]3CCCC[C@H]23)N1C