Reaction Details
TargetSubstance-K receptor
LigandBDBM50404016
Substrate/Competitorn/a
Meas. Tech.ChEMBL_209210 (CHEMBL818004)
Ki 0.050±n/a nM
Citation Harmat, NJGiannotti, DNannicini, RPerrotta, ECriscuoli, MPatacchini, RRenzetti, ARGiuliani, SAltamura, MMaggi, CA Insertion of 2-carboxysuccinate and tricarballylic acid fragments into cyclic-pseudopeptides: new antagonists for the human tachykinin NK-2 receptor. Bioorg Med Chem Lett12:693-6 (2002) Substance-K receptor
Name:Substance-K receptor
Type:Protein
Mol. Mass.:44455.78
Organism:Homo sapiens (Human)
Description:P21452
Residue:398
BDBM50404016
NameBDBM50404016
Synonyms:CHEMBL2112922
TypeSmall organic molecule
Emp. Form.C44H53N7O5
Mol. Mass.759.9355
SMILESO=C(C1CC(=O)N[C@@H](Cc2c[nH]c3ccccc23)C(=O)N[C@@H](Cc2ccccc2)C(=O)N[C@@H](Cc2ccccc2)CNC1=O)N1CCC(CC1)N1CCCCC1