Reaction Details
TargetReverse transcriptase/RNaseH
LigandBDBM50404252
Substrate/Competitorn/a
Meas. Tech.ChEMBL_101642 (CHEMBL710298)
IC50 5370±n/a nM
Citation He, YChen, FSun, GWang, YDe Clercq, EBalzarini, JPannecouque, C 5-Alkyl-2-[(aryl and alkyloxylcarbonylmethyl)thio]-6-(1-naphthylmethyl) pyrimidin-4(3H)-ones as an unique HIV reverse transcriptase inhibitors of S-DABO series. Bioorg Med Chem Lett14:3173-6 (2004) 
 
Reverse transcriptase/RNaseH
Name:Reverse transcriptase/RNaseH
Type:PROTEIN
Mol. Mass.:65229.15
Organism:Human immunodeficiency virus 1
Description:ChEMBL_1473730
Residue:566
BDBM50404252
NameBDBM50404252
Synonyms:BMY-40900 DIDANOSINE
TypeSmall organic molecule
Emp. Form.C10H12N4O3
Mol. Mass.236.2273
SMILESOC[C@@H]1CC[C@@H](O1)n1cnc2c1nc[nH]c2=O