Reaction Details
TargetReverse transcriptase/RNaseH
LigandBDBM50404264
Substrate/Competitorn/a
Meas. Tech.ChEMBL_101646 (CHEMBL710302)
IC50 2670±n/a nM
Citation He, YChen, FSun, GWang, YDe Clercq, EBalzarini, JPannecouque, C 5-Alkyl-2-[(aryl and alkyloxylcarbonylmethyl)thio]-6-(1-naphthylmethyl) pyrimidin-4(3H)-ones as an unique HIV reverse transcriptase inhibitors of S-DABO series. Bioorg Med Chem Lett14:3173-6 (2004) 
 
Reverse transcriptase/RNaseH
Name:Reverse transcriptase/RNaseH
Type:PROTEIN
Mol. Mass.:65229.15
Organism:Human immunodeficiency virus 1
Description:ChEMBL_1473730
Residue:566
BDBM50404264
NameBDBM50404264
Synonyms:CHEMBL108647
TypeSmall organic molecule
Emp. Form.C28H28N2O2S
Mol. Mass.456.599
SMILESCC(C)c1c(Cc2cccc3ccccc23)nc(SCC(=O)c2ccc(C)cc2C)[nH]c1=O