Reaction Details
TargetReverse transcriptase/RNaseH
LigandBDBM50404260
Substrate/Competitorn/a
Meas. Tech.ChEBML_101646
IC50 180±n/a nM
Citation He, YChen, FSun, GWang, YDe Clercq, EBalzarini, JPannecouque, C 5-Alkyl-2-[(aryl and alkyloxylcarbonylmethyl)thio]-6-(1-naphthylmethyl) pyrimidin-4(3H)-ones as an unique HIV reverse transcriptase inhibitors of S-DABO series. Bioorg Med Chem Lett14:3173-6 (2004) 
 
Reverse transcriptase/RNaseH
Name:Reverse transcriptase/RNaseH
Type:PROTEIN
Mol. Mass.:65229.15
Organism:Human immunodeficiency virus 1
Description:ChEMBL_1473730
Residue:566
BDBM50404260
NameBDBM50404260
Synonyms:CHEMBL110625
TypeSmall organic molecule
Emp. Form.C24H19FN2O2S
Mol. Mass.418.483
SMILESCc1c(Cc2cccc3ccccc23)nc(SCC(=O)c2ccc(F)cc2)[nH]c1=O