Reaction Details
Target5-hydroxytryptamine receptor 2B
LigandBDBM50024210
Substrate/Competitorn/a
Meas. Tech.ChEMBL_2918 (CHEMBL617633)
Kd 537.03±n/a nM
Citation Glennon, RAJacyno, JMSalley, JJ 2,3-dihydro and carbocyclic analogues of tryptamines: interaction with serotonin receptors. J Med Chem25:68-70 (1982) 5-hydroxytryptamine receptor 2B
Name:5-hydroxytryptamine receptor 2B
Type:Enzyme Catalytic Domain
Mol. Mass.:53668.47
Organism:RAT
Description:5-HT2B HTR2B RAT::P30994
Residue:479
BDBM50024210
NameBDBM50024210
Synonyms:1H-indole-3-ethanamine 2-(3-indolyl)ethylamine tryptamine
TypeSmall organic molecule
Emp. Form.C10H12N2
Mol. Mass.160.2157
SMILESNCCc1c[nH]c2ccccc12