Reaction Details
TargetcGMP-dependent 3',5'-cyclic phosphodiesterase
LigandBDBM14363
Substrate/Competitorn/a
Meas. Tech.ChEMBL_217506 (CHEMBL823582)
IC50 63100±n/a nM
Citation Picq, MPrigent, AFNémoz, GAndré, ACPacheco, H Pentasubstituted quercetin analogues as selective inhibitors of particulate 3':5'-cyclic-AMP phosphodiesterase from rat brain. J Med Chem25:1192-8 (1983) cGMP-dependent 3',5'-cyclic phosphodiesterase
Name:cGMP-dependent 3',5'-cyclic phosphodiesterase
Type:PROTEIN
Mol. Mass.:104640.72
Organism:Rattus norvegicus
Description:ChEMBL_156330
Residue:928
BDBM14363
NameBDBM14363
Synonyms:3-(2-propoxyphenyl)-2,4,7,8,9-pentazabicyclo[4.3.0]nona-1,3,6-trien-5-one Tocris-0947 | Zaprinast
TypeSmall organic molecule
Emp. Form.C13H13N5O2
Mol. Mass.271.2746
SMILESCCCOc1ccccc1-c1nc2nn[nH]c2c(=O)[nH]1