Reaction Details
TargetBeta-1 adrenergic receptor
LigandBDBM25761
Substrate/Competitorn/a
Meas. Tech.ChEMBL_39343 (CHEMBL655647)
Kd 3.1±n/a nM
Citation Nelson, WLBartels, MJBednarski, PJZhang, SMessick, KHorng, JSRuffolo, RR The 3,4-catechol derivative of propranolol, a minor dihydroxylated metabolite. J Med Chem27:857-61 (1984) Beta-1 adrenergic receptor
Name:Beta-1 adrenergic receptor
Type:Enzyme Catalytic Domain
Mol. Mass.:50540.48
Organism:GUINEA PIG
Description:adrenergic Beta1 ADRB1 GUINEA PIG::B0FL73
Residue:467
BDBM25761
NameBDBM25761
Synonyms:Anapriline CHEMBL27 PROPRANOLOL, d PROPRANOLOL,(+) Propanolol Propranolol | [2-hydroxy-3-(naphthalen-1-yloxy)propyl](propan-2-yl)amine
TypeSmall organic molecule
Emp. Form.C16H21NO2
Mol. Mass.259.3434
SMILESCC(C)NCC(O)COc1cccc2ccccc12