Reaction Details
TargetNeutrophil elastase
LigandBDBM50406245
Substrate/Competitorn/a
Meas. Tech.ChEMBL_21101 (CHEMBL633695)
Ki 5.012E-1±n/a nM
KOFF 4.677E-3 s-1
KON 1E7 M-1s-1
Citation Krantz, ASpencer, RWTam, TFLiak, TJCopp, LJThomas, EMRafferty, SP Design and synthesis of 4H-3,1-benzoxazin-4-ones as potent alternate substrate inhibitors of human leukocyte elastase. J Med Chem33:464-79 (1990) Neutrophil elastase
Name:Neutrophil elastase
Type:Enzyme
Mol. Mass.:28532.38
Organism:Homo sapiens (Human)
Description:P08246
Residue:267
BDBM50406245
NameBDBM50406245
Synonyms:CHEMBL145592
TypeSmall organic molecule
Emp. Form.C11H9Br2NO3
Mol. Mass.363.002
SMILESCCOc1nc2cccc(C(Br)Br)c2c(=O)o1