Reaction Details
TargetNeutrophil elastase
LigandBDBM50406307
Substrate/Competitorn/a
Meas. Tech.ChEMBL_21101 (CHEMBL633695)
Ki 1E1±n/a nM
KOFF 2.455E-3 s-1
KON 2.239E5 M-1s-1
Citation Krantz, ASpencer, RWTam, TFLiak, TJCopp, LJThomas, EMRafferty, SP Design and synthesis of 4H-3,1-benzoxazin-4-ones as potent alternate substrate inhibitors of human leukocyte elastase. J Med Chem33:464-79 (1990) Neutrophil elastase
Name:Neutrophil elastase
Type:Enzyme
Mol. Mass.:28532.38
Organism:Homo sapiens (Human)
Description:P08246
Residue:267
BDBM50406307
NameBDBM50406307
Synonyms:CHEMBL146010
TypeSmall organic molecule
Emp. Form.C14H18N2O3
Mol. Mass.262.3043
SMILESCCc1cc(OC)cc2nc(NC(C)C)oc(=O)c12