Reaction Details
TargetNeutrophil elastase
LigandBDBM50291758
Substrate/Competitorn/a
Meas. Tech.ChEMBL_21101 (CHEMBL633695)
Ki 6.31E0±n/a nM
KOFF 3.388E-4 s-1
KON 5.623E4 M-1s-1
Citation Krantz, ASpencer, RWTam, TFLiak, TJCopp, LJThomas, EMRafferty, SP Design and synthesis of 4H-3,1-benzoxazin-4-ones as potent alternate substrate inhibitors of human leukocyte elastase. J Med Chem33:464-79 (1990) Neutrophil elastase
Name:Neutrophil elastase
Type:Enzyme
Mol. Mass.:28532.38
Organism:Homo sapiens (Human)
Description:P08246
Residue:267
BDBM50291758
NameBDBM50291758
Synonyms:5-Methyl-2-propylamino-benzo[d][1,3]oxazin-4-one | CHEMBL343250
TypeSmall organic molecule
Emp. Form.C12H14N2O2
Mol. Mass.218.2518
SMILESCCCNc1nc2cccc(C)c2c(=O)o1