Reaction Details
TargetNeutrophil elastase
LigandBDBM50406290
Substrate/Competitorn/a
Meas. Tech.ChEMBL_21101 (CHEMBL633695)
Ki 6.31E0±n/a nM
KOFF 4.365E-5 s-1
KON 7.586E3 M-1s-1
Citation Krantz, ASpencer, RWTam, TFLiak, TJCopp, LJThomas, EMRafferty, SP Design and synthesis of 4H-3,1-benzoxazin-4-ones as potent alternate substrate inhibitors of human leukocyte elastase. J Med Chem33:464-79 (1990) Neutrophil elastase
Name:Neutrophil elastase
Type:Enzyme
Mol. Mass.:28532.38
Organism:Homo sapiens (Human)
Description:P08246
Residue:267
BDBM50406290
NameBDBM50406290
Synonyms:CHEMBL141707
TypeSmall organic molecule
Emp. Form.C10H10N2O3
Mol. Mass.206.198
SMILESCCOc1nc2cc(N)ccc2c(=O)o1