Reaction Details
TargetNeutrophil elastase
LigandBDBM50406257
Substrate/Competitorn/a
Meas. Tech.ChEMBL_21101 (CHEMBL633695)
Ki 1E1±n/a nM
KON 3.467E4 M-1s-1
Citation Krantz, ASpencer, RWTam, TFLiak, TJCopp, LJThomas, EMRafferty, SP Design and synthesis of 4H-3,1-benzoxazin-4-ones as potent alternate substrate inhibitors of human leukocyte elastase. J Med Chem33:464-79 (1990) Neutrophil elastase
Name:Neutrophil elastase
Type:Enzyme
Mol. Mass.:28532.38
Organism:Homo sapiens (Human)
Description:P08246
Residue:267
BDBM50406257
NameBDBM50406257
Synonyms:CHEMBL145252
TypeSmall organic molecule
Emp. Form.C10H9NO3
Mol. Mass.191.1834
SMILESCOc1nc2cccc(C)c2c(=O)o1