Reaction Details
TargetPolyunsaturated fatty acid 5-lipoxygenase
LigandBDBM50012434
Substrate/Competitorn/a
Meas. Tech.ChEBML_177026
IC50 3000±n/a nM
Citation Bruneau, PDelvare, CEdwards, MPMcMillan, RM Indazolinones, a new series of redox-active 5-lipoxygenase inhibitors with built-in selectivity and oral activity. J Med Chem34:1028-36 (1991) Polyunsaturated fatty acid 5-lipoxygenase
Name:Polyunsaturated fatty acid 5-lipoxygenase
Type:PROTEIN
Mol. Mass.:78082.31
Organism:Rattus norvegicus
Description:ChEMBL_1432947
Residue:673
BDBM50012434
NameBDBM50012434
Synonyms:(REV-5,901)1-[3-(Quinolin-2-ylmethoxy)-phenyl]-hexan-1-ol 1-[3-(Quinolin-2-ylmethoxy)-phenyl]-hexan-1-ol (RG 5901) CHEMBL8747 REV-901
TypeSmall organic molecule
Emp. Form.C22H25NO2
Mol. Mass.335.4394
SMILESCCCCCC(O)c1cccc(OCc2ccc3ccccc3n2)c1