Reaction Details
TargetThymidylate synthase
LigandBDBM50406713
Substrate/Competitorn/a
Meas. Tech.ChEBML_209982
Ki 0.270000±n/a nM
Citation Bisset, GMPawelczak, KJackman, ALCalvert, AHHughes, LR Syntheses and thymidylate synthase inhibitory activity of the poly-gamma-glutamyl conjugates of N-[5-[N-(3,4-dihydro-2-methyl-4-oxoquinazolin-6-ylmethyl)-N-methylamino ]-2-thenoyl]-L-glutamic acid (ICI D1694) and other quinazoline antifolates. J Med Chem35:859-66 (1992) Thymidylate synthase
Name:Thymidylate synthase
Type:PROTEIN
Mol. Mass.:34957.15
Organism:Mus musculus
Description:ChEMBL_1340097
Residue:307
BDBM50406713
NameBDBM50406713
Synonyms:CHEMBL1202139
TypeSmall organic molecule
Emp. Form.C40H45N7O15
Mol. Mass.863.8232
SMILESCc1nc2ccc(CN(CC#C)c3ccc(cc3)C(=O)N[C@@H](CCC(=O)N[C@@H](CCC(=O)N[C@@H](CCC(=O)N[C@@H](CCC(O)=O)C(O)=O)C(O)=O)C(O)=O)C(O)=O)cc2c(=O)[nH]1