Reaction Details
TargetThymidylate synthase
LigandBDBM50406715
Substrate/Competitorn/a
Meas. Tech.ChEBML_209982
Ki 7.5±n/a nM
Citation Bisset, GMPawelczak, KJackman, ALCalvert, AHHughes, LR Syntheses and thymidylate synthase inhibitory activity of the poly-gamma-glutamyl conjugates of N-[5-[N-(3,4-dihydro-2-methyl-4-oxoquinazolin-6-ylmethyl)-N-methylamino ]-2-thenoyl]-L-glutamic acid (ICI D1694) and other quinazoline antifolates. J Med Chem35:859-66 (1992) Thymidylate synthase
Name:Thymidylate synthase
Type:PROTEIN
Mol. Mass.:34957.15
Organism:Mus musculus
Description:ChEMBL_1340097
Residue:307
BDBM50406715
NameBDBM50406715
Synonyms:CHEMBL355321
TypeSmall organic molecule
Emp. Form.C31H36N6O12S
Mol. Mass.716.716
SMILESCN(Cc1ccc2nc(C)[nH]c(=O)c2c1)c1ccc(s1)C(=O)N[C@@H](CCC(=O)N[C@@H](CCC(=O)N[C@@H](CCC(O)=O)C(O)=O)C(O)=O)C(O)=O