Reaction Details
Target5-hydroxytryptamine receptor 1D
LigandBDBM50406772
Substrate/Competitorn/a
Meas. Tech.ChEBML_1965
IC50 6.3±n/a nM
Citation Street, LJBaker, RCastro, JLChambers, MSGuiblin, ARHobbs, SCMatassa, VGReeve, AJBeer, MSMiddlemiss, DN Synthesis and serotonergic activity of 5-(oxadiazolyl)tryptamines: potent agonists for 5-HT1D receptors. J Med Chem36:1529-38 (1993) 5-hydroxytryptamine receptor 1D
Name:5-hydroxytryptamine receptor 1D
Type:PROTEIN
Mol. Mass.:32680.56
Organism:Sus scrofa
Description:ChEMBL_1963
Residue:291
BDBM50406772
NameBDBM50406772
Synonyms:CHEMBL290657
TypeSmall organic molecule
Emp. Form.C21H22N4O
Mol. Mass.346.4256
SMILESCN(C)CCc1c[nH]c2ccc(cc12)-c1nc(Cc2ccccc2)no1