Reaction Details
Target3-oxo-5-alpha-steroid 4-dehydrogenase 2
LigandBDBM50407307
Substrate/Competitorn/a
Meas. Tech.ChEMBL_204747 (CHEMBL805440)
Ki 20±n/a nM
Citation Holt, DAYamashita, DSKonialian-Beck, ALLuengo, JIAbell, ADBergsma, DJBrandt, MLevy, MA Benzophenone- and indolecarboxylic acids: potent type-2 specific inhibitors of human steroid 5 alpha-reductase. J Med Chem38:13-5 (1995) 3-oxo-5-alpha-steroid 4-dehydrogenase 2
Name:3-oxo-5-alpha-steroid 4-dehydrogenase 2
Type:Enzyme
Mol. Mass.:28406.59
Organism:Homo sapiens (Human)
Description:P31213
Residue:254
BDBM50407307
NameBDBM50407307
Synonyms:CHEMBL285651
TypeSmall organic molecule
Emp. Form.C20H13NO6
Mol. Mass.363.3203
SMILESOC(=O)c1ccc(cc1)C(=O)c1ccc(Oc2ccc(cc2)[N+]([O-])=O)cc1