Reaction Details
TargetHistamine H1 receptor
LigandBDBM50131441
Substrate/Competitorn/a
Meas. Tech.ChEMBL_85812 (CHEMBL878439)
IC50 1.58±n/a nM
Citation ter Laak, AMVenhorst, JDonné-Op den Kelder, GMTimmerman, H The histamine H1-receptor antagonist binding site. A stereoselective pharmacophoric model based upon (semi-)rigid H1-antagonists and including a known interaction site on the receptor. J Med Chem38:3351-60 (1995) Histamine H1 receptor
Name:Histamine H1 receptor
Type:G Protein-Coupled Receptor (GPCR)
Mol. Mass.:55641.53
Organism:Cavia porcellus (domestic guinea pig)
Description:Guinea pig cerebellum was used in binding assay.
Residue:488
BDBM50131441
NameBDBM50131441
Synonyms:9,13b-dihydro-1H-dibenzo[c,f]imidazo[1,5-a]azepin-3-amine EPINASTINE Flurinol WAL 801 | epinastine hydrochloride
TypeSmall organic molecule
Emp. Form.C16H15N3
Mol. Mass.249.3104
SMILESNC1=NCC2N1c1ccccc1Cc1ccccc21