Reaction Details
Target5-hydroxytryptamine receptor 2C
LigandBDBM50407991
Substrate/Competitorn/a
Meas. Tech.ChEMBL_2854 (CHEMBL617495)
Ki 7.94±n/a nM
Citation Forbes, ITDabbs, SDuckworth, DMHam, PJones, GEKing, FDSaunders, DVBlaney, FENaylor, CBBaxter, GSBlackburn, TPKennett, GAWood, MD Synthesis, biological activity, and molecular modeling of selective 5-HT(2C/2B) receptor antagonists. J Med Chem39:4966-77 (1997) 
 
5-hydroxytryptamine receptor 2C
Name:5-hydroxytryptamine receptor 2C
Type:Enzyme
Mol. Mass.:51935.10
Organism:Rattus norvegicus (Rat)
Description:P08909
Residue:460
BDBM50407991
NameBDBM50407991
Synonyms:CHEMBL343666
TypeSmall organic molecule
Emp. Form.C16H13N3OS
Mol. Mass.295.359
SMILESO=C(Nc1cccnc1)N1CCc2cc3sccc3cc12