Reaction Details
Target5-hydroxytryptamine receptor 2C
LigandBDBM50408003
Substrate/Competitorn/a
Meas. Tech.ChEMBL_2854 (CHEMBL617495)
Ki 125.89±n/a nM
Citation Forbes, ITDabbs, SDuckworth, DMHam, PJones, GEKing, FDSaunders, DVBlaney, FENaylor, CBBaxter, GSBlackburn, TPKennett, GAWood, MD Synthesis, biological activity, and molecular modeling of selective 5-HT(2C/2B) receptor antagonists. J Med Chem39:4966-77 (1997) 
 
5-hydroxytryptamine receptor 2C
Name:5-hydroxytryptamine receptor 2C
Type:Enzyme
Mol. Mass.:51935.10
Organism:Rattus norvegicus (Rat)
Description:P08909
Residue:460
BDBM50408003
NameBDBM50408003
Synonyms:CHEMBL148347
TypeSmall organic molecule
Emp. Form.C19H19N3O
Mol. Mass.305.3737
SMILESCc1cn(C)c2cc3CCN(C(=O)Nc4ccccc4)c3cc12