Reaction Details
TargetPeptidyl-prolyl cis-trans isomerase FKBP1A
LigandBDBM50408098
Substrate/Competitorn/a
Meas. Tech.ChEMBL_66276 (CHEMBL857528)
Ki 24000±n/a nM
Citation Dragovich, PSBarker, JEFrench, JImbacuan, MKalish, VJKissinger, CRKnighton, DRLewis, CTMoomaw, EWParge, HEPelletier, LAPrins, TJShowalter, RETatlock, JHTucker, KDVillafranca, JE Structure-based design of novel, urea-containing FKBP12 inhibitors. J Med Chem39:1872-84 (1996) 
 
Peptidyl-prolyl cis-trans isomerase FKBP1A
Name:Peptidyl-prolyl cis-trans isomerase FKBP1A
Type:Isomerase
Mol. Mass.:11953.09
Organism:Homo sapiens (Human)
Description:P62942
Residue:108
BDBM50408098
NameBDBM50408098
Synonyms:CHEMBL298828
TypeSmall organic molecule
Emp. Form.C19H26N2O3
Mol. Mass.330.4213
SMILESCCCN1CC[C@@H]2CCC[C@H](N2C1=O)C(=O)OCc1ccccc1