Reaction Details
TargetPeptidyl-prolyl cis-trans isomerase FKBP1A
LigandBDBM50408103
Substrate/Competitorn/a
Meas. Tech.ChEMBL_66276 (CHEMBL857528)
Ki 790±n/a nM
Citation Dragovich, PSBarker, JEFrench, JImbacuan, MKalish, VJKissinger, CRKnighton, DRLewis, CTMoomaw, EWParge, HEPelletier, LAPrins, TJShowalter, RETatlock, JHTucker, KDVillafranca, JE Structure-based design of novel, urea-containing FKBP12 inhibitors. J Med Chem39:1872-84 (1996) 
 
Peptidyl-prolyl cis-trans isomerase FKBP1A
Name:Peptidyl-prolyl cis-trans isomerase FKBP1A
Type:Isomerase
Mol. Mass.:11953.09
Organism:Homo sapiens (Human)
Description:P62942
Residue:108
BDBM50408103
NameBDBM50408103
Synonyms:CHEMBL293294
TypeSmall organic molecule
Emp. Form.C19H28N2O3
Mol. Mass.332.4372
SMILESCC(C)(C)CNC(=O)N1CCCC[C@H]1C(=O)OCc1ccccc1