Reaction Details
TargetAngiotensin-converting enzyme
LigandBDBM21641
Substrate/Competitorn/a
Meas. Tech.ChEMBL_35981 (CHEMBL646945)
IC50 316.23±n/a nM
Citation Crippen, GM Validation of EGSITE2, a mixed integer program for deducing objective site models for experimental binding data. J Med Chem40:3161-72 (1997) 
 
Angiotensin-converting enzyme
Name:Angiotensin-converting enzyme
Type:Enzyme
Mol. Mass.:149709.01
Organism:Homo sapiens (Human)
Description:n/a
Residue:1306
BDBM21641
NameBDBM21641
Synonyms:2-(2-benzyl-3-sulfanylpropanamido)acetic acid Thiorphan
TypeSmall organic molecule
Emp. Form.C12H15NO3S
Mol. Mass.253.317
SMILESOC(=O)CNC(=O)C(CS)Cc1ccccc1